{"text_format":"1","workbook":"xlsx","n_sheets":20,"sheets":["NAVODILA","KAZALO","POVZETEK","POVZETEK_PO","POVZETEK_SC","IZJAVA","IPI","BS","IPI_T2_T3","BS_T2_T3","IDT_T2_T3","FIKSNI_DEL_T-1","FIKSNI_DEL_T","VARIABILNI_DEL","PRIHODKI","REKAPITULACIJA","BAZA_Sifranti","BAZA","BAZA_AEControl","XML"],"not_rendered":{"charts":0,"images":10,"macros":1,"external_links":0,"defined_names":29,"comments":0,"pivot_tables":1},"unopened":[],"bounds":{"document_bytes":16777216,"sheet_cells":100000,"rows_first":2000,"rows_last":500,"rows_between":2000,"halvings":0,"cell_chars":16384,"cell_head_chars":4096},"cells_cut":0,"cells_raw":0,"read":"whole","date_system":"1900"}

{"sheet":"NAVODILA","index":0,"n_rows":34,"n_cols":3,"rows_kept":34,"cut":false,"hidden":false,"merged":[[24,2,24,3],[5,6,5,8],[5,1,5,3],[6,1,6,3],[23,2,23,3],[20,2,20,3],[21,2,21,3],[22,2,22,3],[15,1,15,3],[4,1,4,3],[14,1,14,3],[7,1,7,3],[9,1,9,3],[13,1,13,3],[11,1,11,3],[30,2,30,3],[31,2,31,3],[32,2,32,3],[33,2,33,3],[25,2,25,3],[26,2,26,3],[27,2,27,3],[28,2,28,3],[29,2,29,3]]}
[]
[]
[null,"Navodila za izpolnjevanje elektronskega obrazca"]
[]
[null,"Elektronski obrazec je namenjen posredovanju zahteve za izdajo soglasja k izhodiščni ceni toplote v skladu s 302. členom Energetskega zakona (Uradni list RS 17/14, 81/15) s strani reguliranih izvajalcev dejavnosti distribucije in proizvodnje toplote."]
[null,"Zavezanec za regulacijo (v nadaljevanju vlagatelj) je:  \n-Distributer z lastno proizvodnjo toplote oz. distributer, ki skladno z določili 1. alineje, prvega odstavka, 284. člena Energetskega zakona (EZ-1) izvaja izbirno gospodarsko javno službo;\n-Reguliran proizvajalec, ki je skladno z določili 283. člena EZ-1 in 1. odstavka, 299. člena EZ-1 zavezan k regulaciji cene dobavljene toplote distributerju oz. distributerju z lastno proizvodnjo toplote."]
{"$rows_left_out":29}
{"sheet":"KAZALO","index":1,"n_rows":25,"n_cols":4,"rows_kept":25,"cut":false,"hidden":true,"merged":[]}
[]
[]
[null,"Kazalo delovnih listov obrazca:"]
[]
[null,"ID","Delovni list","Vsebina delovnega lista"]
[null,1,"NAVODILA"]
{"$rows_left_out":20}
{"sheet":"POVZETEK","index":2,"n_rows":59,"n_cols":28,"rows_kept":59,"cut":false,"hidden":false,"merged":[[43,3,43,6],[44,3,44,6],[45,3,45,6],[3,2,3,8],[36,3,36,6],[37,3,37,6],[16,1,16,3],[16,4,16,6],[19,4,19,8],[18,1,18,8],[4,2,4,8]]}
[null,null,null,null,null,null,null,null,null,null,null,null,null,null,null,null,null,null,null,null,null,null,null,null,null,null,"KONTROLA IZPOLNJENOSTI LISTA"]
[]
[null,null,null,null,null,null,null,null,null,null,null,null,null,null,null,null,null,null,null,null,null,null,null,null,null,null,{"$f":"AB12-AB11+AA39+AB30","v":13},"Sumarne napake"]
[null,null,"ZAHTEVA ZA IZDAJO SOGLASJA K IZHODIŠČNI CENI TOPLOTE ZA DALJINSKO OGREVANJE"]
[null,null,"Osnovni podatki o vložitvi zahteve v skladu z Aktom o metodologiji za oblikovanje cene toplote za daljinsko ogrevanje, \nAkta o metodologiji za oblikovanje cene toplote za daljinsko ogrevanje, Uradni list RS 2/17"]
[]
{"$rows_left_out":54}
{"sheet":"POVZETEK_PO","index":3,"n_rows":47,"n_cols":27,"rows_kept":47,"cut":false,"hidden":true,"merged":[[3,2,3,7],[4,2,4,7]]}
[null,null,null,null,null,null,null,null,null,null,null,null,null,null,null,null,null,null,null,null,null,null,null,null,null,null,"KONTROLA IZPOLNJENOSTI LISTA"]
[]
[]
[null,null,{"$f":"POVZETEK!C4","v":"ZAHTEVA ZA IZDAJO SOGLASJA K IZHODIŠČNI CENI TOPLOTE ZA DALJINSKO OGREVANJE"}]
[null,null,"Prvo oblikovanje izhodiščne cene ob začetku opravljanja dejavnosti v skladu z 9. in 10. členom \nAkta o metodologiji za oblikovanje cene toplote za daljinsko ogrevanje, Uradni list RS 2/17"]
[]
{"$rows_left_out":42}
{"sheet":"POVZETEK_SC","index":4,"n_rows":55,"n_cols":28,"rows_kept":55,"cut":false,"hidden":true,"merged":[[39,2,39,7],[43,2,43,7],[3,2,3,7],[4,2,4,7]]}
[null,null,null,null,null,null,null,null,null,null,null,null,null,null,null,null,null,null,null,null,null,null,null,null,null,null,"KONTROLA IZPOLNJENOSTI LISTA"]
[]
[null,null,null,null,null,null,null,null,null,null,null,null,null,null,null,null,null,null,null,null,null,null,null,null,null,null,"Število vseh polj",11]
[null,null,{"$f":"POVZETEK!C4","v":"ZAHTEVA ZA IZDAJO SOGLASJA K IZHODIŠČNI CENI TOPLOTE ZA DALJINSKO OGREVANJE"},null,null,null,null,null,null,null,null,null,null,null,null,null,null,null,null,null,null,null,null,null,null,null,"Št. izpolnjenih polj",{"$f":"COUNTA(E20:E26,E34:E35,C40,C44)","v":0}]
[null,null,"Sprememba izhodiščne cene v skladu s 15. členom\nAkta o metodologiji za oblikovanje cene toplote za daljinsko ogrevanje\", Uradni list RS 2/17",null,null,null,null,null,null,null,null,null,null,null,null,null,null,null,null,null,null,null,null,null,null,null,"Razlika",{"$f":"AB3-AB4","v":11}]
[]
{"$rows_left_out":50}
{"sheet":"IZJAVA","index":5,"n_rows":78,"n_cols":28,"rows_kept":78,"cut":false,"hidden":true,"merged":[[3,2,3,6],[4,2,4,6],[59,5,59,6],[71,5,71,6]]}
[null,null,null,null,null,null,null,null,null,null,null,null,null,null,null,null,null,null,null,null,null,null,null,null,null,null,"KONTROLA IZPOLNJENOSTI LISTA"]
[]
[null,null,null,null,null,null,null,null,null,null,null,null,null,null,null,null,null,null,null,null,null,null,null,null,null,null,"Število vseh polj",{"$f":"IF(POVZETEK!E17=\"Regulirani proizvajalec toplote\",28,35)","v":35}]
[null,null,{"$f":"POVZETEK!C4","v":"ZAHTEVA ZA IZDAJO SOGLASJA K IZHODIŠČNI CENI TOPLOTE ZA DALJINSKO OGREVANJE"},null,null,null,null,null,null,null,null,null,null,null,null,null,null,null,null,null,null,null,null,null,null,null,"Št. izpolnjenih polj",{"$f":"COUNTA(E34:G35,E42:G47,E55:E60,E68:E72)","v":0}]
[null,null,"Izjava o posredovanih podatkih\nAkta o metodologiji za oblikovanje cene toplote za daljinsko ogrevanje, Uradni list RS 2/17",null,null,null,null,null,null,null,null,null,null,null,null,null,null,null,null,null,null,null,null,null,null,null,"Razlika",{"$f":"AB3-AB4","v":35}]
[]
{"$rows_left_out":73}
{"sheet":"IPI","index":6,"n_rows":76,"n_cols":28,"rows_kept":76,"cut":false,"hidden":true,"merged":[[77,1,77,9],[3,2,3,8],[4,2,4,8]]}
[null,null,null,null,null,null,null,null,null,null,null,null,null,null,null,null,null,null,null,null,null,null,null,null,null,null,"KONTROLA IZPOLNJENOSTI LISTA"]
[]
[null,null,null,null,null,null,null,null,null,null,null,null,null,null,null,null,null,null,null,null,null,null,null,null,null,null,"Število vseh polj",152]
[null,null,{"$f":"POVZETEK!C4","v":"ZAHTEVA ZA IZDAJO SOGLASJA K IZHODIŠČNI CENI TOPLOTE ZA DALJINSKO OGREVANJE"},null,null,null,null,null,null,null,null,null,null,null,null,null,null,null,null,null,null,null,null,null,null,null,"Št. izpolnjenih polj",{"$f":"COUNTA(F23:I26,F29:I31,F33:I35,F37:I41,F44:I47,F49:I50,F52:I54,F56:I59,F61:I63,F65:I66,F68:I69,F71:I73)","v":0}]
[null,null,"Načrtovan izkaz poslovnega izida po dejavnostih za leto t\nAkta o metodologiji za oblikovanje cene toplote za daljinsko ogrevanje\", Uradni list RS 2/17",null,null,null,null,null,null,null,null,null,null,null,null,null,null,null,null,null,null,null,null,null,null,null,"Razlika",{"$f":"AB3-AB4","v":152}]
[]
{"$rows_left_out":71}
{"sheet":"BS","index":7,"n_rows":139,"n_cols":29,"rows_kept":139,"cut":false,"hidden":true,"merged":[[140,1,140,9],[3,2,3,8],[4,2,4,8]]}
[null,null,null,null,null,null,null,null,null,null,null,null,null,null,null,null,null,null,null,null,null,null,null,null,null,null,"KONTROLA IZPOLNJENOSTI LISTA"]
[]
[null,null,null,null,null,null,null,null,null,null,null,null,null,null,null,null,null,null,null,null,null,null,null,null,null,null,"Število vseh polj",{"$f":"AC4+AC5","v":316}]
[null,null,{"$f":"POVZETEK!C4","v":"ZAHTEVA ZA IZDAJO SOGLASJA K IZHODIŠČNI CENI TOPLOTE ZA DALJINSKO OGREVANJE"},null,null,null,null,null,null,null,null,null,null,null,null,null,null,null,null,null,null,null,null,null,null,null,"Št. izpolnjenih polj BS",{"$f":"COUNTA(F27:I31,F34:I37,F39:I43,F46:I49,F51:I53,F55:I58,F60:I60,F62:I65,F68:I70,F72:I74,F76:I79,F81:I81,F92:I94,F96:I104,F106:I108,F111:I114,F116:I121,F123:I123,F125:I128,F130:I136,F80:I80)","v":0},168]
[null,null,"Načrtovana bilanca stanja po dejavnostih za leto t\nAkta o metodologiji za oblikovanje cene toplote za daljinsko ogrevanje\", Uradni list RS 2/17",null,null,null,null,null,null,null,null,null,null,null,null,null,null,null,null,null,null,null,null,null,null,null,"Št. izpolnjenih polj BS",{"$f":"COUNTA(F92:I94,F96:I104,F106:I108,F111:I114,F116:I121,F123:I123,F125:I128,F130:I136)","v":0},148]
[null,null,null,null,null,null,null,null,null,null,null,null,null,null,null,null,null,null,null,null,null,null,null,null,null,null,"Razlika",{"$f":"AB3-AB4","v":316}]
{"$rows_left_out":134}
{"sheet":"IPI_T2_T3","index":8,"n_rows":78,"n_cols":28,"rows_kept":78,"cut":false,"hidden":true,"merged":[[3,3,3,6],[4,3,4,6],[79,1,79,7]]}
[null,null,null,null,null,null,null,null,null,null,null,null,null,null,null,null,null,null,null,null,null,null,null,null,null,null,"KONTROLA IZPOLNJENOSTI LISTA"]
[]
[null,null,null,null,null,null,null,null,null,null,null,null,null,null,null,null,null,null,null,null,null,null,null,null,null,null,"Število vseh polj",76]
[null,null,null,{"$f":"POVZETEK!C4","v":"ZAHTEVA ZA IZDAJO SOGLASJA K IZHODIŠČNI CENI TOPLOTE ZA DALJINSKO OGREVANJE"},null,null,null,null,null,null,null,null,null,null,null,null,null,null,null,null,null,null,null,null,null,null,"Št. izpolnjenih polj",{"$f":"COUNTA(F22:G25,F28:G30,F32:G34,F36:G40,F43:G46,F48:G49,F51:G53,F55:G58,F60:G62,F64:G65,F67:G68,F70:G72)","v":0}]
[null,null,null,"Izkaz poslovnega izida družba za leto t-3 in t-2",null,null,null,null,null,null,null,null,null,null,null,null,null,null,null,null,null,null,null,null,null,null,"Razlika",{"$f":"AB3-AB4","v":76}]
[]
{"$rows_left_out":73}
{"sheet":"BS_T2_T3","index":9,"n_rows":137,"n_cols":29,"rows_kept":137,"cut":false,"hidden":true,"merged":[[3,2,3,7],[4,2,4,7],[138,1,138,8]]}
[null,null,null,null,null,null,null,null,null,null,null,null,null,null,null,null,null,null,null,null,null,null,null,null,null,null,"KONTROLA IZPOLNJENOSTI LISTA"]
[]
[null,null,null,null,null,null,null,null,null,null,null,null,null,null,null,null,null,null,null,null,null,null,null,null,null,null,"Število vseh polj",156]
[null,null,{"$f":"POVZETEK!C4","v":"ZAHTEVA ZA IZDAJO SOGLASJA K IZHODIŠČNI CENI TOPLOTE ZA DALJINSKO OGREVANJE"},null,null,null,null,null,null,null,null,null,null,null,null,null,null,null,null,null,null,null,null,null,null,null,"Št. izpolnjenih polj BS",{"$f":"COUNTA(F25:G29,F32:G35,F37:G41,F44:G47,F49:G51,F53:G56,F58:G58,F60:G63,F66:G68,F70:G72,F74:G77,F79:G79)","v":0},82]
[null,null,"Bilanca stanja družba za leto t-3 in t-2",null,null,null,null,null,null,null,null,null,null,null,null,null,null,null,null,null,null,null,null,null,null,null,"Št. izpolnjenih polj KAP",{"$f":"COUNTA(F90:G92,F94:G102,F104:G106,F109:G112,F114:G119,F121:G121,F123:G126,F128:G134)","v":0},74]
[null,null,null,null,null,null,null,null,null,null,null,null,null,null,null,null,null,null,null,null,null,null,null,null,null,null,"Razlika ",{"$f":"AB3-AB4-AB5","v":156}]
{"$rows_left_out":132}
{"sheet":"IDT_T2_T3","index":10,"n_rows":111,"n_cols":27,"rows_kept":111,"cut":false,"hidden":true,"merged":[[3,2,3,7],[4,2,4,7],[112,1,112,8]]}
[null,null,null,null,null,null,null,null,null,null,null,null,null,null,null,null,null,null,null,null,null,null,null,null,null,null,"KONTROLA IZPOLNJENOSTI LISTA"]
[]
[]
[null,null,{"$f":"POVZETEK!C4","v":"ZAHTEVA ZA IZDAJO SOGLASJA K IZHODIŠČNI CENI TOPLOTE ZA DALJINSKO OGREVANJE"}]
[null,null,"Izkaz denarnih tokov za leto t-3 in t-2"]
[]
{"$rows_left_out":106}
{"sheet":"FIKSNI_DEL_T-1","index":11,"n_rows":74,"n_cols":32,"rows_kept":74,"cut":false,"hidden":true,"merged":[[3,2,3,8],[4,2,4,8],[75,2,75,10],[57,4,57,5],[57,6,57,7],[57,2,57,3],[19,2,19,3],[19,4,19,14],[38,2,38,3],[38,4,38,14],[57,8,57,10]]}
[null,null,null,null,null,null,null,null,null,null,null,null,null,null,null,null,null,null,null,null,null,null,null,null,null,null,"KONTROLA IZPOLNJENOSTI LISTA"]
[]
[null,null,null,null,null,null,null,null,null,null,null,null,null,null,null,null,null,null,null,null,null,null,null,null,null,null,"Število vseh polj",82]
[null,null,{"$f":"POVZETEK!C4","v":"ZAHTEVA ZA IZDAJO SOGLASJA K IZHODIŠČNI CENI TOPLOTE ZA DALJINSKO OGREVANJE"},null,null,null,null,null,null,null,null,null,null,null,null,null,null,null,null,null,null,null,null,null,null,null,"Št. izpolnjenih polj",{"$f":"COUNTA(E25:F25,E27:E29,G27:I29,E31:E33,F32:F33,J25:M25,N31,J32:M33,J44:M44,E44:F44,E46:E48,E50:E52,F51:F52,G46:I48,J51:M52,N50,E62:E70,G62:G70)","v":0},null,null,null,32]
[null,null,"Realizirani in načrtovani fiksni stroški proizvodnje in distribucije toplote v letu t-1\nAkta o metodologiji za oblikovanje cene toplote za daljinsko ogrevanje\", Uradni list RS 2/17",null,null,null,null,null,null,null,null,null,null,null,null,null,null,null,null,null,null,null,null,null,null,null,"Razlika",{"$f":"AB3-AB4","v":82},null,null,null,32]
[null,null,null,null,null,null,null,null,null,null,null,null,null,null,null,null,null,null,null,null,null,null,null,null,null,null,null,null,null,null,null,18]
{"$rows_left_out":69}
{"sheet":"FIKSNI_DEL_T","index":12,"n_rows":65,"n_cols":28,"rows_kept":65,"cut":false,"hidden":true,"merged":[[3,2,3,8],[4,2,4,8],[66,2,66,10],[52,6,52,7],[38,2,38,3],[38,4,38,7],[19,2,19,3],[19,4,19,14]]}
[null,null,null,null,null,null,null,null,null,null,null,null,null,null,null,null,null,null,null,null,null,null,null,null,null,null,"KONTROLA IZPOLNJENOSTI LISTA"]
[]
[null,null,null,null,null,null,null,null,null,null,null,null,null,null,null,null,null,null,null,null,null,null,null,null,null,null,"Število vseh polj",41]
[null,null,{"$f":"POVZETEK!C4","v":"ZAHTEVA ZA IZDAJO SOGLASJA K IZHODIŠČNI CENI TOPLOTE ZA DALJINSKO OGREVANJE"},null,null,null,null,null,null,null,null,null,null,null,null,null,null,null,null,null,null,null,null,null,null,null,"Št. izpolnjenih polj",{"$f":"COUNTA(E25:F25,E27:E29,E31:E33,F32:F33,G27:I29,J25:M25,J32:M33,N31,E43:E51)","v":0}]
[null,null,"Načrtovani fiksni stroški proizvodnje in distribucije toplote v letu t\nAkta o metodologiji za oblikovanje cene toplote za daljinsko ogrevanje\", Uradni list RS 2/17",null,null,null,null,null,null,null,null,null,null,null,null,null,null,null,null,null,null,null,null,null,null,null,"Razlika",{"$f":"AB3-AB4","v":41}]
[]
{"$rows_left_out":60}
{"sheet":"VARIABILNI_DEL","index":13,"n_rows":257,"n_cols":40,"rows_kept":257,"cut":false,"hidden":true,"merged":[[17,28,19,28],[17,29,18,29],[17,30,18,30],[17,31,18,31],[17,32,18,32],[237,7,237,13],[258,2,258,10],[3,2,3,7],[4,2,4,7],[47,4,47,9],[47,10,47,13],[94,4,94,9],[140,4,140,9],[140,10,140,14],[186,4,186,9],[186,10,186,14],[94,10,94,13],[229,3,229,12],[41,3,41,10],[233,4,233,6]]}
[null,null,null,null,null,null,null,null,null,null,null,null,null,null,null,null,null,null,null,null,null,null,null,null,null,null,"KONTROLA IZPOLNJENOSTI LISTA"]
[]
[null,null,null,null,null,null,null,null,null,null,null,null,null,null,null,null,null,null,null,null,null,null,null,null,null,null,{"$f":"AC15+AD49+AD95+AE142+AE188","v":9},"Sumarne napake"]
[null,null,{"$f":"POVZETEK!C4","v":"ZAHTEVA ZA IZDAJO SOGLASJA K IZHODIŠČNI CENI TOPLOTE ZA DALJINSKO OGREVANJE"}]
[null,null,"Struktura in cene upravičenih variaiblnih stroškov\nAkta o metodologiji za oblikovanje cene toplote za daljinsko ogrevanje\", Uradni list RS 2/17"]
[]
{"$rows_left_out":252}
{"sheet":"PRIHODKI","index":14,"n_rows":222,"n_cols":46,"rows_kept":222,"cut":false,"hidden":true,"merged":[[192,1,192,2],[192,3,192,5],[205,1,205,2],[205,3,205,5],[223,1,223,9],[3,2,3,7],[4,2,4,7],[21,3,21,4],[21,5,21,6],[21,7,21,10],[106,11,106,13],[149,7,149,10],[149,11,149,13],[21,11,21,13],[63,3,63,4],[63,5,63,6],[63,7,63,10],[63,11,63,13],[149,3,149,4],[149,5,149,6],[106,3,106,4],[106,5,106,6],[106,7,106,10]]}
[null,null,null,null,null,null,null,null,null,null,null,null,null,null,null,null,null,null,null,null,null,null,null,null,null,null,"KONTROLA IZPOLNJENOSTI LISTA"]
[]
[null,null,null,null,null,null,null,null,null,null,null,null,null,null,null,null,null,null,null,null,null,null,null,null,null,null,{"$f":"(AA22+AA64+AA107+AA150)+(SUM(AJ26:AJ58)+SUM(AJ68:AJ100)+SUM(AJ111:AJ143)+SUM(AJ154:AJ186)+AF198+AF201+AF220)","v":1},"Sumarne napake"]
[null,null,{"$f":"POVZETEK!C4","v":"ZAHTEVA ZA IZDAJO SOGLASJA K IZHODIŠČNI CENI TOPLOTE ZA DALJINSKO OGREVANJE"}]
[null,null,"Tarifni cenik po vrstah storitev in vrstah odjemalcev in povprečna cena\nAkta o metodologiji za oblikovanje cene toplote za daljinsko ogrevanje\", Uradni list RS 2/17"]
[]
{"$rows_left_out":217}
{"sheet":"REKAPITULACIJA","index":15,"n_rows":48,"n_cols":9,"rows_kept":48,"cut":false,"hidden":true,"merged":[[3,3,3,7],[4,3,4,7]]}
[]
[]
[]
[null,null,null,{"$f":"POVZETEK!C4","v":"ZAHTEVA ZA IZDAJO SOGLASJA K IZHODIŠČNI CENI TOPLOTE ZA DALJINSKO OGREVANJE"}]
[null,null,null,"Rekapitulacija"]
[]
{"$rows_left_out":43}
{"sheet":"BAZA_Sifranti","index":16,"n_rows":38,"n_cols":48,"rows_kept":38,"cut":false,"hidden":true,"merged":[]}
[]
["tblS_FVEnote",null,null,null,null,null,null,null,null,null,null,null,"tblS_VarStroški_SD_1",null,null,null,null,null,null,null,"tblS_IzvajalecTip",null,null,null,"tblS_Tip_IC",null,null,"tblS_DaNe",null,null,null,null,"tblS_SCRazlog"]
[]
["ID","Enota_Fiksna postavka","Enota_Variabilna postavka","Enota_FKolicina","Enota_Vkolicina",null,null,null,null,null,null,null,"ID","ID_STRO_PD","ID_STRO_SD","STROSEK_SD_Naziv","Količina_Enota","Enota_Strošek/Količino","SM",null,"ID","Naziv","EZ_Clen",null,"ID","Naziv",null,"ID","Naziv",null,null,null,"ID","Razlog za spremembo",null,"ID","Stolpec1","Leto_t","Leto_tx1","Leto_tx2","Leto_tx3",null,"ID","Naziv","Dejavnost",null,"ID","Izbira"]
[1,"EUR/MW/leto","EUR/MWh","MW","MWh",null,null,null,null,null,null,null,0,null,"AXX-XX","Predhodno izberite vrsto vlagatelja (tabela 2)","Enota","Enota",0,null,1,"distributer toplote z lastno proizvodnjo","ki skladno z določili 1. alineje prvega odstavka 284. člena Energetskega zakona (EZ-1) izvaja izbirno gospodarsko javno službo",null,1,"variabilni del izhodiščne cene ",null,1,"DA",null,null,null,1,"Večje tehnološke spremembe",null,1,"t",{"$f":"YEAR(TODAY())+1","v":2020},{"$f":"\"t (\"&AL5&\")\"","v":"t (2020)"},null,null,null,1,"distributer toplote z lastno proizvodnjo","Proizvodnja_Distribucija DT",null,1]
[2,"EUR/m²/leto","EUR/m²","m²","m²",null,null,null,null,null,null,null,null,null,null,null,null,null,null,null,2,"distributer toplote","ki skladno z določili 1. alineje prvega odstavka 284. člena Energetskega zakona (EZ-1) izvaja izbirno gospodarsko javno službo",null,2,"fiksni del izhodiščne cene",null,2,"NE",null,null,null,2,"Sprememba tarifnega sistema v povezavi s sistemskimi obratovalnimi navodili",null,2,"t-1",{"$f":"AL5-1","v":2019},{"$f":"\"t-1 (\"&AL6&\")\"","v":"t-1 (2019)"},{"$f":"\"1.1.\"&tblS_Leta[[#This Row],[Leto_t]]&\" - \"&TEXT((DATE(tblS_Leta[[#This Row],[Leto_t]],MONTH(POVZETEK!E28)-2,1)-1),\"d.m.yyyy\")","v":"1.1.2019 - 31.10.2018"},{"$f":"TEXT((DATE(tblS_Leta[[#This Row],[Leto_t]],MONTH(POVZETEK!E28)-2,1)),\"d.m.yyyy\")&\" - \"&TEXT((DATE(tblS_Leta[[#This Row],[Leto_t]],12,31)),\"d.m.yyyy\")","v":"1.11.2018 - 31.12.2019"},null,2,"distributer toplote","Distribucija_DT",null,2,"DA"]
{"$rows_left_out":33}
{"sheet":"BAZA","index":17,"n_rows":72,"n_cols":18,"rows_kept":72,"cut":false,"hidden":true,"merged":[]}
["Kazalo","ID_DSistem","DSistem Naziv_Distributer","NAZIV_POS-L","ObcinaNaziv",null,null,"Kazalo","ID_POS","NAZIV_POS-L","NAZIV_POS-FAE","Naslov_S",null,null,"ID","Datum Aktivnost_OD","Datum Aktivnost_DO","DatumT"]
[1,"VTDS-8035440000-2-21","Sistem daljinskega ogrevanja na lesno biomaso Bovec, Bovec","Javno podjetje za proizvodnjo in dobavo toplotne energije DOLB Bovec d.o.o.","Občina Bovec",null,null,1,2236818000,"BIOENERGETIKA TODRAŽ d.o.o.","BIOENERGETIKA","Todraž 1, 4224 Gorenja vas",null,null,1,{"$f":"DATE(YEAR(tbl_DatumAktivnost[DatumT])-1,1,1)","v":"2018-01-01"},{"$f":"DATE(YEAR(tbl_DatumAktivnost[DatumT])+1,1,1)","v":"2020-01-01"},{"$f":"TODAY()","v":"2019-11-12"}]
[2,"PADS-5226406000-2-4","Parovod - TE-TOL, Ljubljana","JAVNO PODJETJE ENERGETIKA LJUBLJANA d.o.o.","Mestna občina Ljubljana",null,null,2,5050804000,"DOM UPOKOJENCEV Podbrdo","DOM_UPOKOJENCEV","Podbrdo 33, 5243 Podbrdo"]
[3,"PADS-5226406000-3-4","Parovod TOŠ, Ljubljana","JAVNO PODJETJE ENERGETIKA LJUBLJANA d.o.o.","Mestna občina Ljubljana",null,null,3,5015375000,"DOMPLAN, družba za inženiring, nepremičnine, urbanizem in energetiko, d.d.","DOMPLAN","Bleiweisova cesta 14, 4000 Kranj"]
[4,"DSHL-5222109000-2-11","Sistem daljinskega hlajenja Velenje","KOMUNALNO PODJETJE VELENJE Izvajanje komunalnih dejavnosti, d.o.o.","Mestna občina Velenje",null,null,4,2010593000,"E 3, ENERGETIKA, EKOLOGIJA, EKONOMIJA, d.o.o.","E3","Erjavčeva ulica 24, 5000 Nova Gorica"]
[5,"VTDS-5914531000-1-1","Sistem daljinskega ogrevanja Celje","ENERGETIKA CELJE javno podjetje, d.o.o.","Mestna občina Celje",null,null,5,1934139000,"EKO LES ENERGETIKA Ogrevanje na sekance lesne biomase d.o.o.","EKO_LES_ENERGETIKA","Pod klancem 2, 5220 Tolmin"]
{"$rows_left_out":67}
{"sheet":"BAZA_AEControl","index":18,"n_rows":19,"n_cols":6,"rows_kept":19,"cut":false,"hidden":true,"merged":[]}
["Napake sumarno","Delovni list",null,{"$f":"XML!E2","v":"AE-DT_VIC_2018_18.02_"}]
[669,"Delovni list",null,{"$f":"TEXT(YEAR(TODAY()),\"####\")","v":"2019"},{"$f":"CONCATENATE(TEXT(YEAR(TODAY()),\"####\"), RIGHT(\"0\"&TEXT(MONTH(TODAY()),\"##\"),2),RIGHT(\"0\"&TEXT(DAY(TODAY()),\"##\"),2))","v":"20191112"},{"$f":"CONCATENATE(D3,E3,F3)","v":"121837"}]
[0,"NAVODILA",null,{"$f":"RIGHT(\"0\"&TEXT(HOUR(NOW()),\"##\"),2)","v":"12"},{"$f":"RIGHT(\"0\"&TEXT(MINUTE(NOW()),\"##\"),2)","v":"18"},{"$f":"RIGHT(\"0\"&TEXT(SECOND(NOW()),\"##\"),2)","v":"37"}]
[0,"KAZALO",null,{"$f":"D1&IFERROR(VLOOKUP(MATCH(POVZETEK!J11,tblS_Izvajalci[ID_POS],0),tblS_Izvajalci[],4)&\"_\"&E2&\"_\"&F2,\"NEDEFINIRAN\"&\"_\"&E2&\"_\"&F2)","v":"AE-DT_VIC_2018_18.02_NEDEFINIRAN_20191112_121837"}]
[{"$f":"POVZETEK!AA3","v":13},"POVZETEK",null,{"$f":"NOW()","v":43781.512923032409}]
[0,"POVZETEK_PO",null,{"$f":"TODAY()","v":"2019-11-12"}]
{"$rows_left_out":14}
{"sheet":"XML","index":19,"n_rows":46,"n_cols":21,"rows_kept":46,"cut":false,"hidden":true,"merged":[]}
[null,"Namen obrazca:","Vloga za izdajo soglasja k izhodiščni ceni 2019"]
[null,"Ime obrazca:","AE-DT_VIC_2018",null,{"$f":"C2&\"_\"&RIGHT(LEFT(C3,7),5)&\"_\"","v":"AE-DT_VIC_2018_18.02_"}]
[null,"Verzija obrazca:","v.18.02.00"]
[null,"Datum izdelave obrazca:","2018-10-29"]
[null,"Datum zadnje posodobitve obrazca:","2019-11-12","Popravek kontrole tarifnih cenikov"]
[null,"Odgovorni vodja projekta:","Aleksander TRUPEJ"]
{"$rows_left_out":40}